Sat Nov 27 2021 19:03:15 UTC
When using your debugger, consider who the bugger was that buggered things up.
Hide Search Description
212 bugs found.
ID Product Comp Assignee Status Resolution Summary Changed
54478 JMeter Main issues NEW --- Wrong response time with mode=Statistical and num_sample_threshold > 1 when using remote mode. 2013-04-04
55510 JMeter Main issues NEW --- In distributed testing : totalThreads always show 0 in GUI 2013-11-04
45169 JMeter Main issues NEW --- SampleResult idleTime not always taken into account 2013-11-23
56161 JMeter HTTP issues NEW --- Data is corrupted on PUT request when not using 100-continue 2014-02-19
56538 JMeter Main issues NEW --- Mail reader sampler: "Aggregate Report" returns random POP statistics 2014-06-08
56539 JMeter Main issues REOP --- Mail reader sampler: When Number of messages to retrieve is superior to 1, Number of samples should only show 1 not the number of messages retrieved 2014-07-18
56979 JMeter HTTP issues NEW --- Cannot send "*" as OPTIONS URL; it is converted to "/*" 2014-09-12
56159 JMeter Main issues NEW --- Spurious notification that the test plan has changed 2014-09-13
56983 JMeter Main issues NEW --- View Results Tree:When reloading results from XML, content type is not filled in SampleResult 2014-09-16
53540 JMeter HTTP issues REOP --- HTTP Cache Manager - 304 not modified on the main page does not retrieve the embedded resources 2014-10-22
57491 JMeter HTTP issues NEW --- AJP Sample GUI includes timeout fields but these are not used 2015-03-25
57787 JMeter Main issues NEW --- The Once Only controller behaves correctly under a Thread Group or Loop Controller, but otherwise its behaviour is not consistent (or clearly specified) 2015-04-18
57910 JMeter Main issues NEW --- CSV DataSet thread and thread group sharing might not work due to identityHashCode 2015-05-09
56630 JMeter Main issues NEW --- Module Controller does not work properly in included script 2015-05-13
58014 JMeter Main issues NEW --- Counter config under Random/Interleave controller 2015-06-09
58108 JMeter HTTP issues NEW --- use sampler.toString() in BeanShell PreProcessor , HTTP JMeterProperty can not be replaced anymore 2015-07-08
58415 JMeter Main issues NEW --- JMeter.bat fails if JMETER_BIN is set and bin folder contains spaces 2015-09-15
54481 JMeter Main issues REOP --- Transaction Controller in "Generate Parent Sample" mode : Assertion fails while is should not 2016-02-27
59223 JMeter Main issues NEW --- Stack overflow in Random Controller/Interleave Controller if it contains child Throughput Controller elements 2016-03-23
59241 JMeter Main issues NEW --- BackendListener should not be aware of a particular implementation of BackendListenerClient : GraphiteBackendListenerClient 2016-03-27
59440 JMeter Main issues NEW --- causes unhelpful console message 2016-05-08
59052 JMeter Main issues REOP --- jmeter.bat don't use the JM_LAUNCH to test java version, so java versions could be different 2016-05-31
59265 JMeter Main issues NEW --- totalThreads + activeThreads + warnIndicator tooltip not updated when we change the language in the GUI 2016-06-11
59632 JMeter HTTP issues NEW --- HTML format the "Failed to Parse HTML : NULL" error message is displayed. 2016-07-31
59943 JMeter HTTP issues REOP --- Problem with Node order using HtmlParsingUtils.getDOM which can impact HTML Link Parser 2016-08-19
59751 JMeter Main issues NEW --- GUI language settings in without effect 2016-09-14
60148 JMeter HTTP issues NEW --- Proxy recorder doesn't cancel pending requests when stopped 2016-09-19
54449 JMeter HTTP issues NEW --- HTTPS requests using HC4 hang for 4-5 seconds when using IP's without reverse DNS under Windows 2016-09-27
43484 JMeter Main issues NEW --- Remote Statistical mode needs to collect min/max separately 2016-12-30
60657 JMeter HTTP issues NEW --- Slow connection feature slows too much with HTTPS 2017-01-26
56816 JMeter Main issues NEW --- Assigning null to a BeanShell variable in a JSR223 sampler does not work as expected 2017-01-27
54156 JMeter Main issues NEW --- DurationAssertion does not seem to make difference between Main sample only and Main sample and sub-samples for time 2017-01-27
55827 JMeter Main issues NEW --- Iteration over a view on a synchronized collection without obtaining a lock on the collection 2017-02-24
55375 JMeter Main issues REOP --- StackOverflowError with ModuleController in Non-GUI mode if its name is the same as the target node 2017-02-25
61024 JMeter HTTP issues NEW --- Embedded resource download with recursive call can lead to error "org.apache.http.conn.ConnectionPoolTimeoutException" 2017-04-21
59973 JMeter Main issues REOP --- Issue with XML version in JTL files 2017-04-26
58679 JMeter Main issues REOP --- Replace the xpp pull parser in xstream with a java6+ standard solution 2017-04-26
61285 JMeter Main issues NEW --- SMTP Sampler doesn't configure localhost name 2017-07-16
61141 JMeter Main issues NEED --- The option "Dereference aliases"&"Return object" doesn't work when test the LDAP extended request search 2017-07-20
61254 JMeter Main issues NEW --- Summariser : Active thread count in is not correct during high load distributing test when using statistical mode 2017-07-24
59169 JMeter Main issues NEW --- ModuleController loses the reference to target controller if any of the elements in the path to referenced Controller is renamed 2017-08-27
61118 JMeter Main issues NEW --- Save Responses to File generates bad paths and names 2017-09-16
61622 JMeter HTTP issues NEW --- HTTP Authorization Manager: Colon in Username is not rejected for BASIC_DIGEST 2017-10-16
60696 JMeter HTTP issues NEED --- SPNEGO always canonicalizes host names, Option to pick behavior would be welcome 2017-11-04
61729 JMeter Main issues NEW --- File name validation doesn't check for using not allowed symbols 2017-11-06
61623 JMeter Main issues NEW --- When calling "Duplicate" on a Thread Group that contains a View Results Tree, the VRT in initial Thread Group receives the Sample Results of the cloned Thread Group 2017-11-11
61567 JMeter Main issues REOP --- JMeter test ran through JUnit fails within maven-surefire-plugin (mvn clean install) 2017-11-22
61826 JMeter Main issues NEW --- JMS Point To Point : 2 JMS P2P where 1st one is listener on a queue used by second one can mix up 2017-11-28
51480 JMeter Main issues NEW --- ConstantThroughputTimer in shared mode all threads start with an incorrect delay of 0 2017-11-30
61885 JMeter Main issues NEW --- Revert enabled after Save although can't revert 2017-12-10
62064 JMeter Main issues NEW --- Java 9 : Illegal reflective access by Groovy warnings due to GROOVY-8339 2018-01-31
61884 JMeter Main issues NEW --- Java 9 illegal reflective access from DarculaLaf to HTMLEditorKit.DEFAULT_STYLES_KEY due to issue 41 in Darcula 2018-01-31
62045 JMeter HTTP issues NEED --- timing difference for large (?) requests 2018-03-08
62008 JMeter Main issues NEW --- Listener does not process user defined variable (containing groovy script) in distributed testing 2018-03-21
62015 JMeter HTTP issues REOP --- Quotes in cookie values are stripped 2018-03-29
62256 JMeter Main issues NEW --- JMS (P2P) and JMS Subscriber not working properly with Throughput Controller in a Test script 2018-04-04
62282 JMeter Main issues NEW --- 'File->Open Recent' entries open the wrong file when running 2 or more instances of JMeter at the same time 2018-04-11
60855 JMeter Main issues NEW --- Use of default encoding: FileReader/Writer and InputStreamReader/OutputStreamWriter 2018-05-31
62421 JMeter Main issues NEW --- Field value of 'Validation Query' (JDBC Connection Configuration) is lost when saving test plan. 2018-06-11
60120 JMeter HTTP issues REOP --- JMeter 3.0 HTTP Request POST parameters are silently encoded 2018-06-25
62601 JMeter Main issues NEED --- While Login the Application through jmeter Premature end of chunk coded message body: closing chunk expected is displayed 2018-09-01
62671 JMeter Main issues NEW --- embedded_resources_use_md5 and css parser 2018-09-03
62675 JMeter Main issues NEW --- ConstantThroughputTimer bad setting properties, and not included in TestPlan 2018-09-13
62573 JMeter Main issues NEW --- Script Recorder Target controller not saved with test plan 2018-10-27
62510 JMeter Main issues NEW --- executing remote test from command line uses wrong user defined variables 2018-10-28
60236 JMeter Main issues NEW --- ThroughputController does not give same results depending on Timer presence or not 2018-10-28
59101 JMeter HTTP issues NEW --- Wrong behavior with no keepalive when using JAVA Implementation (HC4 fixed since JMeter 3.0) 2018-11-01
59436 JMeter Main issues NEW --- JMeter tests should not use a special version of by default 2018-11-27
62299 JMeter Main issues NEW --- Duplicate copies embedded elements twice when expanded 2018-12-28
62997 JMeter HTTP issues NEED --- java.lang.IllegalArgumentException: URLDecoder: Illegal hex characters in escape (%) pattern - For input string: " " 2019-02-15
63278 JMeter HTTP issues NEW --- Controller Label Average column in Report summaries values of slaves 2019-03-22
63301 JMeter Main issues NEW --- can the change json encoding format In the url data? 2019-03-29
63154 JMeter Main issues NEW --- User Defined Variables: Darcula theme doesn't allow copy/paste to another element 2019-05-13
63420 JMeter Main issues NEW --- On Windows 10 Surface Pro, the JSyntaxTextArea has really very small fonts 2019-05-13
63316 JMeter HTTP issues NEED --- HTTP Request Defaults -Review All Embedded Resources parsing bug 2019-05-13
63369 JMeter Main issues REOP --- Unable to launch GUI mode if using DisplayLink driver for external monitors 2019-05-14
63429 JMeter HTTP issues NEED --- Wrong static responses parsing error. 2019-05-14
57039 JMeter Main issues NEW --- Inconsistency with the undo/redo log 2019-05-20
57040 JMeter Main issues NEW --- Save changes prompt appear even once all changes were undone 2019-05-20
63343 JMeter HTTP issues NEED --- When path contains %3A, JMeter sends the decoded path ((":" instead of "%3A") 2019-06-16
63536 JMeter HTTP issues NEW --- JMeter support for vars.putObject binary post data and gzip post data 2019-07-08
63552 JMeter Main issues NEW --- Java 12 - Illegal reflective access by org.codehaus.groovy.reflection.CachedConstructor$1 2019-07-08
63642 JMeter HTTP issues NEW --- View Results Tree: Difficulty in using 'Find' feature on Response body section 2019-08-06
63481 JMeter HTTP issues REOP --- Encoding is happening while sending parameter from Post request in Jmeter 2019-08-23
62760 JMeter HTTP issues NEW --- StackOverFlow error returned for IF controller when Loop count is set to forever 2019-09-05
63755 JMeter Main issues NEW --- Inconsistent behavior when Thread Group "forever" and "loop count" value set at the same time 2019-09-19
62795 JMeter Main issues REOP --- JMeter master sometimes ends distributed test even though some of the slaves have not finished 2019-10-07
63762 JMeter Main issues REOP --- JMeter gives - [Fatal Error] Test%20Plan.jmx:5106:59: Character reference "&#x1f" is an invalid XML character - error during a record run 2019-10-15
63873 JMeter Main issues NEW --- influxdbBackendListener and mode=StrippedDiskStore problem ? 2019-10-23
63914 JMeter Main issues NEW --- Gradle clean does not remove all generated files 2019-11-10
63915 JMeter Main issues NEW --- Deprecated Gradle features used 2019-11-10
63917 JMeter HTTP issues NEW --- Transfer-encoding: chucked in HTTP Header Manager caused error 2019-11-11
63858 JMeter HTTP issues NEED --- DNS Cache Manager - Static Host Table in distributed mode 2019-11-12
63962 JMeter Main issues NEW --- Save response to file and View Results XML Log - inconsistent coding and not BodySize(which is not logged in JTL XML) 2019-11-26
63986 JMeter HTTP issues NEW --- Jmeter change the POST request when Json body contain blanket and slash 2019-12-09
63990 JMeter Main issues NEW --- SSL RMI Binding 2019-12-10
64010 JMeter HTTP issues NEW --- HttpCLient4 adds default header that can not be easly removed. (Java does not) 2019-12-17
64012 JMeter Main issues NEW --- Hardcoded enableAutoCommitOnReturn for dataSource cause failed test suite for some DBs 2019-12-17
63880 JMeter HTTP issues NEED --- while executing in non-GUI mode after enabling the generate parent sample option in transaction controller also In JTL file am getting Sub-samples 2019-12-29
64103 JMeter Main issues NEW --- Throughput controller causes stack overflow/latency spike towards end of test 2020-01-28
64145 JMeter Main issues NEW --- CookieManager cleanup in postprocessor behaves strangely 2020-02-15
63004 JMeter HTTP issues NEED --- Java vs. HTTPclient4 very slow response time difference, HTTPclient4 adding 30s to response time 2020-02-26
62100 JMeter Main issues NEW --- UX - Mark Duration as mandatory 2020-03-11
64219 JMeter Main issues NEW --- Nested CSV while loops 2020-03-12
64224 JMeter Main issues NEW --- View Results Tree: Response Data->Response Body is illegible with Darcula theme 2020-03-13
64228 JMeter HTTP issues NEW --- Response Assertion do wrong when enabling the Retrieve All Embedded Resources from HTML Files in sampler 2020-03-15
64229 JMeter HTTP issues NEW --- A duplicate main sampler is under the main sampler in View Results Tree 2020-03-15
62653 JMeter Main issues NEW --- Apache JMeter not launching on Windows 7 when using default DarculaLaf LAF 2020-03-17
64382 JMeter Main issues NEW --- PreciseThroughputTimer: batchThreadDelay is not used in nightly build 2020-04-26
64075 JMeter HTTP issues NEED --- Japanease Shift-JIS string contain some specific character cause text broken at script recording. 2020-04-26
64343 JMeter HTTP issues NEW --- AWS S3 multipart upload 2020-04-27
64248 JMeter Main issues NEW --- View Results Tree : Different character sizes (All version of JMeter) 2020-04-27
64298 JMeter HTTP issues NEED --- Cannot read csv file when executing script on command line after referencing csv file with relative path in csv data set 2020-04-27
64209 JMeter Main issues NEED --- Issue with the form selection on Tririga application with Jmeter proxy recording 2020-04-27
64374 JMeter HTTP issues NEED --- Not Able to Capture Response when there is no Content-Type header 2020-04-27
64399 JMeter HTTP issues NEW --- content-type “application/x-www-form-urlencoded” doesn't encode “+” to %2b 2020-04-30
64367 JMeter Main issues NEW --- UDV defined in test plan failed to be expanded in distributed testing mode 2020-05-01
64444 JMeter HTTP issues NEW --- JMeter Response Time Mismatch : Parent Controller Response Time > Sum of Child Samplers Response Time 2020-05-15
64556 JMeter HTTP issues REOP --- Same form key for all iterations 2020-07-25
64396 JMeter Main issues NEW --- Incorrectly calculates the response time of parent sampler at the end of the test when using Transaction controller along with timers and duration of test 2020-07-26
64268 JMeter HTTP issues NEW --- Duplicate HTTP query parameters when using Parameter in HTTP Request Defaults 2020-07-26
64535 JMeter Main issues NEED --- Nimbus and Metal: Copy and Paste not working for http request name field. 2020-08-06
64636 JMeter Main issues NEW --- Curl importer can't parse empty data argument 2020-08-06
64590 JMeter Main issues REOP --- TransactionSampler does not compute header size/body size information 2020-08-06
64487 JMeter Main issues NEW --- Backend Listener 2020-08-10
64589 JMeter HTTP issues NEED --- Failing Transaction Controller not reported in View Results Tree if it's inside an IfController with "Evaluate for all children" checked 2020-08-16
63255 JMeter HTTP issues NEW --- HTTP Post Request fails due to triple backslash in Body Data 2020-09-03
64738 JMeter Main issues NEW --- Function Helper shows up to 2 parameters only 2020-09-14
64534 JMeter HTTP issues NEW --- Java implementation is using my Windows credentials instead of Authorization Manager for NTLM. 2020-10-22
60756 JMeter Main issues NEW --- Module Controller included in a Thread Group with the same name as linked Test Fragment looses link after reopening saved test plan 2020-10-24
64668 JMeter Main issues NEW --- Closing "Warning!" pop-up by Cross icon doesn't interrupt the request 2020-10-24
64795 JMeter Main issues NEED --- Generate summary report may not output a summary line in the configured interval (summariser.interval) 2020-10-31
60649 JMeter HTTP issues NEW --- HTTP(S) Test Script Recorder: wrong postdata 2020-11-14
64928 JMeter Main issues NEED --- Non deterministic behaviour for Constant Throughput Timer and wrongly set value (via variable) 2020-11-22
64948 JMeter Main issues NEED --- Report Generation Exception: Consumer failed with message.. Could not delete intermediate file 2020-12-18
64954 JMeter Main issues NEW --- Critical Section Controller causes waiting threads not to stop 2020-12-19
64587 JMeter Main issues NEW --- LAF reloading does not work completely 2020-12-19
65017 JMeter Main issues NEED --- Darklaf: Navigating in JTree with left / right key behaves as up / down key 2020-12-21
65019 JMeter HTTP issues NEW --- HTTP Sampler/Files upload tab - add checkbox to enable/disable files to upload 2020-12-22
65000 JMeter Main issues NEED --- JMeter test not stopping after duration ends in distribution mode 2020-12-28
65031 JMeter Main issues NEED --- Ramp-up period not accurate 2020-12-30
65028 JMeter Main issues NEED --- client.rmi.localport is not documented properly 2020-12-31
64253 JMeter Main issues NEW --- MailReaderSampler with SSL authentication 2021-01-02
63631 JMeter HTTP issues NEED --- HTTP(s) Test Script Recorder uses User Defined Variables in alphabetical descending sort instead UI sort order 2021-01-02
65012 JMeter Main issues NEED --- Comments section improvements for all tree pane elements 2021-01-03
65032 JMeter Main issues NEW --- File/Open recent menu issues 2021-01-04
64994 JMeter HTTP issues NEW --- Sending HTTP Request Name to Jenkins Performance Plugin even though it is under "Transaction Controller" with "Generate Parent Sample" enabled 2021-01-05
65041 JMeter Main issues NEW --- JMeter httpclient.timeout property not working as expected 2021-01-05
65071 JMeter Main issues NEW --- Transaction Controller appears on View Results Tree and JMeter results file when using prev.setIgnore() in JSR223 Processor 2021-01-11
65013 JMeter Main issues NEW --- POST multipart/form-data cURL code generated from Postman is not imported correctly 2021-01-15
64465 JMeter Main issues NEW --- Gradle module metadata refers to invalid 'bom' artifact 2021-01-21
65109 JMeter HTTP issues NEED --- jmeter cli command create infinity folders of report 2021-02-06
65107 JMeter HTTP issues NEED --- CannotResolveClassException: org.apache.jmeter.protocol.http.control.HeaderManager 2021-02-06
64118 JMeter Main issues NEED --- In html report Time Vs Threads graph (jmeter distributed environment) shows only one slave machines thread count instead of combined thread count on x axis. 2021-02-06
65116 JMeter Main issues NEED --- Custom JMeter Functions plugin is not detected if jmx file contains any of its functions 2021-02-06
65129 JMeter Main issues NEW --- Foreach logic controller cannot understand two or more input variable prefixes 2021-02-08
65072 JMeter Main issues NEW --- Values of declared variables within the same User Defined Variables element are not evaluated 2021-02-12
65140 JMeter Main issues NEW --- HTTP Sampler/Body data or Files upload tab selections are not remembered 2021-02-15
65147 JMeter HTTP issues NEED --- Load throughput 1/10 while running Jmeter5.3 captured test on Jmeter 5.0 2021-02-18
65163 JMeter Main issues NEW --- ApacheJMeter_core 5.2 maven dependency broken 2021-03-03
65164 JMeter Main issues NEW --- Send data to influxDB failed when measurement is replaced by Property or Variable 2021-03-03
65076 JMeter HTTP issues NEED --- Issue with passing AuthCookie due to AzureGatewayAffinityCors in Azure Environment 2021-03-06
65175 JMeter Main issues NEW --- Result Status Action Handler when set to 'Continue' is not overriding the 'Action to be taken after a Sampler error' in Thread Group 2021-03-09
65108 JMeter HTTP issues NEW --- Passing a numeric variable to GraphQL HTTP Request logs an error and doesn't send any variables. 2021-03-12
65199 JMeter Main issues NEW --- JMeter generates HTML report statistics result error 2021-03-20
60546 JMeter HTTP issues NEED --- Bypass ssl certificate 2021-03-30
65205 JMeter Main issues NEED --- Question mark needs to be escaped multiple times in JSR223 Processors 2021-04-10
65189 JMeter HTTP issues NEED --- Comparison Assertion Visualizer is displaying HTTP Request details of same sampler in Left & Right section 2021-04-10
65236 JMeter Main issues NEW --- Not able to send BytesMessages with a JMSReplyTo 2021-04-12
65237 JMeter Main issues NEW --- Use custom directory when launching JMeter from sources (e.g. build/standalone) 2021-04-24
65271 JMeter HTTP issues NEW --- HTTP DELETE request params are added to the body of request 2021-04-28
65274 JMeter Main issues NEW --- Generated HTTP sampler from cURL does not add data in corresponding tabs 2021-04-28
65290 JMeter Main issues NEW --- How can I use Jmeter desktop application as web app and expose this on some port ? 2021-05-06
61669 JMeter HTTP issues NEED --- HTTP sampler corrupts file with Chinese characters when upload file with http sampler (NEED REPRODUCER CASE to confirm) 2021-05-08
65270 JMeter Main issues NEED --- POST application/x-www-form-urlencoded cURL code generated from Postman is not imported correctly 2021-05-08
60922 JMeter Main issues NEW --- AccessLogSampler returns error result when EOF is reached 2021-05-11
64039 JMeter Main issues REOP --- vars.put did not work after invoke jmeter beanshell preprocessor related api 2021-05-14
65322 JMeter Main issues NEW --- Regex Extractor uses old values when extending variable in template 2021-05-23
65318 JMeter Main issues NEW --- Incorrect display of decimal numbers in JSON related elements 2021-05-30
65068 JMeter Main issues NEW --- Toggle button issue 2021-06-03
65305 JMeter Main issues NEED --- JMS Subscriber infinite loop 2021-06-06
65213 JMeter Main issues NEED --- Endurance Testing using jmeter stopped abruptly in distributed environment 2021-06-06
65191 JMeter Main issues NEED --- JMeter not calculating accurate response time. 2021-06-06
65364 JMeter Main issues NEW --- If controller debug message is not shown in Log Viewer panel 2021-06-07
65417 JMeter HTTP issues NEW --- not providing correct base dir path on JMeter server (load generator in distributed setup) 2021-07-01
65434 JMeter Main issues NEW --- Interleave controller inside if controller does not interleave samplers equally 2021-07-05
65399 JMeter Main issues NEED --- Big difference in performance between non-gui and gui executions 2021-07-08
63620 JMeter HTTP issues NEW --- jmeter GUI hangs when viewing Big JSON body with no space 2021-07-09
64846 JMeter Main issues NEW --- Total Throughput calculation on html report is not correct 2021-07-14
64786 JMeter Main issues NEED --- During distributed testing, slave - >master network usage is high. 2021-07-19
65457 JMeter HTTP issues NEW --- SSL Handshake errors on fetching the embedded resources 2021-07-20
65461 JMeter HTTP issues NEW --- WrappedX509KeyManager ignores key types 2021-07-23
63974 JMeter Main issues NEW --- resultcollector.action_if_file_exists=DELETE don't work 2021-07-30
65503 JMeter HTTP issues NEED --- HTTP Request Post with large JSON body fails 2021-08-17
65474 JMeter HTTP issues NEED --- issue in sign up button 2021-08-18
65450 JMeter Main issues NEED --- Reminder is returned as float while using javascript function 2021-08-23
65440 JMeter HTTP issues NEED --- jmeter 5 cannot use key store with http sample while jmeter 4 can 2021-08-23
65526 JMeter Main issues NEED --- Some Options from "File" should be work properly. Am not able to do any operations like Save, Open, Save As my ongoing Test Plans. 2021-08-29
65299 JMeter Main issues NEED --- JSONPathAssertion attributes are out of order 2021-08-29
65545 JMeter Main issues NEW --- Jmeter 5.4.1 vs 5.3 : content is no more auto fit into right panel. (see video) 2021-09-03
65552 JMeter Main issues NEED --- Groovy classes not unloading 2021-09-05
65580 JMeter Main issues NEW --- user.classpath, search_paths, test plan class path all ignored if JMeter run programmatically 2021-09-18
65601 JMeter HTTP issues NEW --- Javascript/AJAX Support on Web UI Pages 2021-09-28
65217 JMeter Main issues NEED --- Problem in test for timeShift function 2021-09-30
65583 JMeter Main issues NEED --- While Controller not getting execute when use more than twice in Test Plan 2021-09-30
65569 JMeter Main issues NEED --- JSR223 sampler SampleResult.setIgnore() caches script even when unchecked caching 2021-10-16
65039 JMeter Main issues NEED --- java.nio.charset.MalformedInputException: Input length = 1 by import groovy script 2021-10-16
65469 JMeter Main issues NEED --- View result table sampler is not working properly. 2021-10-18
65646 JMeter HTTP issues NEW --- GraphQL Request Sampler sets incorrect Content-Type header of text/plain 2021-10-22
65657 JMeter Main issues NEW --- Add support for compressed format of csv data files for Data Set Config element and log files 2021-10-27
65664 JMeter HTTP issues NEW --- JMeter is sending the cookie is being sent as a string in POST instead JSON 2021-11-20
65685 JMeter Main issues NEED --- Not able to generate report at end of Jmeter test 2021-11-20
212 bugs found.


File a new bug in the "JMeter" product