Bug 47578 - compile ERROR with ssl
Summary: compile ERROR with ssl
Alias: None
Product: Apache httpd-2
Classification: Unclassified
Component: Build (show other bugs)
Version: 2.2.11
Hardware: PC Linux
: P2 normal (vote)
Target Milestone: ---
Assignee: Apache HTTPD Bugs Mailing List
Keywords: MassUpdate
Depends on:
Reported: 2009-07-24 21:13 UTC by wang qiang
Modified: 2018-11-07 21:08 UTC (History)
0 users


Note You need to log in before you can comment on or make changes to this bug.
Description wang qiang 2009-07-24 21:13:50 UTC
I download the newest version apache 2.2.11.The compiler error does not come out with version 2.2.3.

I use openssl also.
I download the newest version of openssl 1.0.0 - beta3, and compile&install successfully.

I try to compile the apache with the option below

./configure --prefix=/usr/local/apache2 --enable-module=so --enable-ssl=static --with-ssl=/usr/local/openssl --enable-module=rewrite --enable-cache --enable-disk-cache --enable-mem-cache --enable-file-cache --with-mpm=prefork --enable-dav-fs --enable-dav

and got the error below.

ssl_engine_init.c: In function `ssl_init_ctx_verify':
ssl_engine_init.c:549: error: `STACK' undeclared (first use in this function)
ssl_engine_init.c:549: error: (Each undeclared identifier is reported only once
ssl_engine_init.c:549: error: for each function it appears in.)
ssl_engine_init.c:549: error: syntax error before ')' token
ssl_engine_init.c: In function `ssl_init_FindCAList':
ssl_engine_init.c:1129: warning: pointer type mismatch in conditional expression
make[3]: *** [ssl_engine_init.lo] Error 1
make[3]: Leaving directory `/software/src/httpd-2.2.11/modules/ssl'
make[2]: *** [all-recursive] Error 1
make[2]: Leaving directory `/software/src/httpd-2.2.11/modules/ssl'
make[1]: *** [all-recursive] Error 1
make[1]: Leaving directory `/software/src/httpd-2.2.11/modules'
make: *** [all-recursive] Error 1
Comment 1 Ruediger Pluem 2009-07-25 00:53:12 UTC
Currently 2.2.x does not work with openssl 1.0.0 (only trunk does). Please use a stable openssl release.
Comment 2 Peter Kolbus 2010-05-29 13:34:20 UTC
I have seen this too on a new installation with Fedora 13.  2.2.15 builds just fine.
Comment 3 William A. Rowe Jr. 2018-11-07 21:08:04 UTC
Please help us to refine our list of open and current defects; this is a mass update of old and inactive Bugzilla reports which reflect user error, already resolved defects, and still-existing defects in httpd.

As repeatedly announced, the Apache HTTP Server Project has discontinued all development and patch review of the 2.2.x series of releases. The final release 2.2.34 was published in July 2017, and no further evaluation of bug reports or security risks will be considered or published for 2.2.x releases. All reports older than 2.4.x have been updated to status RESOLVED/LATER; no further action is expected unless the report still applies to a current version of httpd.

If your report represented a question or confusion about how to use an httpd feature, an unexpected server behavior, problems building or installing httpd, or working with an external component (a third party module, browser etc.) we ask you to start by bringing your question to the User Support and Discussion mailing list, see [https://httpd.apache.org/lists.html#http-users] for details. Include a link to this Bugzilla report for completeness with your question.

If your report was clearly a defect in httpd or a feature request, we ask that you retest using a modern httpd release (2.4.33 or later) released in the past year. If it can be reproduced, please reopen this bug and change the Version field above to the httpd version you have reconfirmed with.

Your help in identifying defects or enhancements still applicable to the current httpd server software release is greatly appreciated.