This Bugzilla instance is a read-only archive of historic NetBeans bug reports. To report a bug in NetBeans please follow the project's instructions for reporting issues.

Sat Mar 2 2024 19:08:43 UTC
Hide Search Description
218 bugs found.
ID Product Comp Assignee Status Resolution Summary Changed
256452 projects Maven tstupka REOP --- Project order corruption after NB startup 2016-09-20
255908 versionc Code ovrabec RESO FIXE NullPointerException at org.netbeans.modules.versioning.util.Utils.getLineEnding 2016-02-02
257526 cnd Remote alexvsimon VERI FIXE Palette text drag and drop no longer functional if the C plugin is enabled 2016-01-29
256206 platform Outline& mentlicher VERI FIXE TableCellEditor getCellEditor(Object node, String columnID) called on wrong node when the column is sorted 2016-02-03
257412 debugger Java mentlicher VERI FIXE Debugger deadlocks if breakpoint configured to Suspend All Threads 2016-02-04
255955 platform Text mmetelka VERI FIXE Deadlock in LineVector.getLinesInRange() 2016-02-04
257422 versionc Git ovrabec VERI FIXE org.eclipse.jgit.errors.MissingObjectException: Missing unknown bf6696fce2cff7455c58914cb9aea102fe9d6b35 2016-02-04
257695 cnd Code Mod petrk VERI FIXE inaccuracy tests: Big regression 2016-02-02
256471 javascri Editor ppisl VERI FIXE JSHint is having issues when 'Generate JsHint global directive' 2016-02-03
256017 php Project tmysik VERI FIXE NB freeze after start 2016-02-04
256912 cnd Code Mod vkvashin VERI FIXE [newcodemodel]There is no code model when project is placed in folder with non-ASCII symbols in path 2015-12-21
257788 cnd Remote vkvashin VERI FIXE try to add ARM host (java.io.IOException: Error creating directory C:\Program Files\NetBeans 8.1\C_\Users\sova\AppData\Local\NetBeans\Cache\8.1\remote-files\192.168.1.5_22_sova) 2016-02-08
255957 cnd Remote V alexvsimon VERI FIXE remote VCS unit tests are failing 2016-03-16
255999 cnd Editor alexvsimon VERI FIXE Source file errors after running Code Assistant->Reparse Project twice. 2016-03-16
256202 cnd Remote V alexvsimon VERI FIXE Duplicate action names in context menu 2016-03-16
256205 cnd Code Mod alexvsimon VERI FIXE [newcodemodel] automatic test breaks code model in Clucene project 2016-03-16
256236 cnd Remote V alexvsimon VERI FIXE Remote Git Ignore command causes UnsupportedOperationException 2016-03-16
256262 cnd Code Mod alexvsimon VERI FIXE Code model does not recognize system macros 2016-03-16
256649 cnd Remote V alexvsimon VERI FIXE Remote Git cannot commit file 2015-12-21
256650 cnd Remote V alexvsimon VERI FIXE Remote Git -shows wrong status for files modified from outside IDE 2015-12-21
256868 cnd Navigati alexvsimon VERI FIXE FindUsages slowdown 2016-01-29
256989 cnd Remote V alexvsimon VERI FIXE Remote Git cannot perform Push to Upstream 2015-12-21
257024 cnd Remote V alexvsimon VERI FIXE Remote Git Show Outgoing fails 2016-02-02
257078 cnd Remote V alexvsimon VERI FIXE NullPointerException at org.netbeans.modules.git.remote.ui.repository.RepositoryBrowserPanel$TagChildren.refreshTags 2015-12-21
257518 cnd Project alexvsimon VERI FIXE unamanaged project from OSS 12.4 is incorrectly parsed in NB 8.1 2016-02-04
257545 cnd Navigati danilasergeyev VERI FIXE Format string inspector (and security inspectors) does not work right 2016-02-02
256523 cnd Mixed De henk89 VERI FIXE Step Into from java to native code fails due the missed file 2016-03-16
256145 guibuild Code issues VERI FIXE Holding Shift key to add multiple components to a GUI Form is not working 2016-02-01
256544 debugger Code mentlicher VERI FIXE NullPointerException at org.netbeans.modules.debugger.ui.views.debugging.DebuggingViewComponent$4.run 2016-02-08
256590 debugger Code mentlicher VERI FIXE NullPointerException at org.netbeans.modules.viewmodel.TreeModelRoot.destroy 2016-02-08
252310 platform Text mmetelka VERI FIXE org.openide.text.NbDocument$DocumentRenderer.renderToInt: LowPerformance took 255234 ms. 2016-02-08
255977 versionc Git ovrabec VERI FIXE NetBeans 8.1 RC2 Git plugin Show Incoming no longer working for individual directory or individual file 2016-02-02
256272 cnd Code Mod petrk VERI FIXE java.lang.Exception: replacing ClassifierUID:KeyBasedUID on OffsDeclKey: result[w 2226-2262] {/export/home/tester/test_projects/boost_1_55_0/boost/phoenix/stl/cmath.hpp; /export/home/tester/test_projects/boost_1_55_0/N/} to self UID 2016-03-16
256295 cnd Mixed De petrk VERI FIXE Removed 'Mixed development' item in menu in Netbeans 8.1 2016-02-29
256764 cnd Code Mod petrk VERI FIXE AssertionError at org.netbeans.modules.cnd.modelimpl.csm.deep.LazyStatementImpl.getStatementTokenStream 2016-01-29
256791 cnd Code Mod petrk VERI FIXE failing SelectModelTestCase.testSelectModelGetFunctions on Ubuntu test machine 2016-03-04
257152 cnd Code Mod petrk VERI FIXE was [Bug 256791 - failing SelectModelTestCase.testSelectModelGetFunctions on Ubuntu test machine] 2016-03-04
257187 cnd Code Mod petrk VERI FIXE FindUsages resolving regression 2016-01-29
256865 javascri Editor ppisl VERI FIXE Yii project background scanning of project keep hanging 2016-02-04
255817 utilitie Test Run theofanis VERI FIXE NullPointerException: The activatedFileObjects parameter cannot be null 2016-02-02
255861 web HTML Pro tmysik VERI FIXE Unable to download Twitter Bootstrap 2.3.2 when creating a new HTML project 2016-02-02
256488 javascri Tools tmysik VERI FIXE Grunt/Gulp Actions are not shown on files not directly in project folder 2016-02-03
256582 javascri Tools tmysik VERI FIXE List of custom Grunt/Gulp tasks not displayed 2016-02-05
255901 projects Generic tstupka VERI FIXE Error mark does not disappear after resolving syntax error 2016-02-02
256040 connecte Bugzilla tstupka VERI FIXE [81cat] AssertionError at org.netbeans.modules.bugzilla.issue.BugzillaIssue.setFieldValue 2016-02-02
255919 cnd Debugger vkvashin VERI FIXE NullPointerException at org.netbeans.modules.cnd.debugger.common2.debugger.NativeDebuggerManager.debug 2016-02-02
256151 cnd Remote vkvashin VERI FIXE Freeze after remote disconnection 2016-02-02
256637 cnd Remote vkvashin VERI FIXE IDE opens wrong file in full remote model 2015-12-22
256770 cnd Code Mod vkvashin VERI FIXE Changing toolchain on multiple projects causes problems 2016-02-03
257258 cnd Remote vkvashin VERI FIXE In Services tab "New C/C++ Project..." menu item calls 2 "New Project" wizards 2016-02-01
257806 cnd Remote vkvashin VERI FIXE A11y test failed for newly added host connection settings 2016-02-08
257811 cnd Project vkvashin VERI FIXE Strange configuration text in project properties dialog 2016-02-08
256187 cnd Code Mod vv159170 VERI FIXE [newcodemodel] incosistency between FileEntry.size and Buffer.size 2015-12-10
216611 cnd Code Mod alexvsimon VERI FIXE Change in include directive causes wrong macro hyperlink 2016-02-03
249933 cnd -- Other alexvsimon VERI FIXE File Dialog Not Displaying "dot" Directories 2015-12-22
249953 cnd Editor alexvsimon VERI FIXE braces not indented accordingly 2016-02-01
253404 cnd Mixed De alexvsimon VERI FIXE Broken Code Assistance in generated JNI project 2016-02-02
254692 cnd Editor alexvsimon VERI FIXE exception when open "Failed includes dialog" 2016-03-16
255034 cnd Remote alexvsimon VERI FIXE Add a connect timeout to host properties UI [was: ssh connection issue] 2016-02-03
255405 cnd Remote V alexvsimon VERI FIXE Remote Mercurial Clone Other causes NullPointerException 2016-03-16
255873 cnd Remote alexvsimon VERI FIXE AssertionError: Path must be absolute: C:/qt/qt5.1.1/tools/mingw48_32/i686-w64-mingw32/include/sec_api 2016-03-16
255893 cnd Remote V alexvsimon VERI FIXE java.net.MalformedURLException at org.netbeans.modules.remotefs.versioning.api.VCSFileProxySupport.findExistingParent 2016-03-16
255894 cnd Code Mod alexvsimon VERI FIXE NullPointerException at org.netbeans.modules.cnd.modelimpl.content.project.GraphContainer.gatherIncludedFiles 2016-03-16
255933 cnd Editor alexvsimon VERI FIXE Syntax highlighting errors and other errors in header files not in logical folder 2016-03-16
255936 cnd -- Other alexvsimon VERI FIXE "Unable to find any valid shell." window instead of External Terminal 2016-03-16
256045 cnd Code Mod alexvsimon VERI FIXE Incorrect fix for "missing virtual keyword" hint 2016-03-16
256098 cnd Project alexvsimon VERI FIXE NullPointerException at org.netbeans.modules.cnd.makeproject.PathMapperProjectMetadataFactory.read 2016-03-16
256109 cnd Navigati alexvsimon VERI FIXE NullPointerException at org.netbeans.modules.cnd.callgraph.impl.CallGraphPanel.setModel 2016-03-16
256247 cnd Project alexvsimon VERI FIXE misspelled "Sumary" 2016-03-16
256274 cnd Project alexvsimon VERI FIXE APTFileSearch* and NativeFileSearch are String based, but need to be FSPath-based 2016-03-16
256358 cnd Project alexvsimon VERI FIXE [dark] text hard to read on project setup 2016-03-16
256359 cnd Project alexvsimon VERI FIXE [dark] project discovery status hard to read 2016-03-16
256379 cnd Editor alexvsimon VERI FIXE "Insert Code" does not work if a class does not have fields 2016-02-01
256406 cnd Navigati alexvsimon VERI FIXE There is no navigator action to go to object declaration. 2016-03-16
256408 cnd Code Mod alexvsimon VERI FIXE no any active cache transaction in CsmDefineHyperlinkProvider.goToDeclaration(CsmDefineHyperlinkProvider.java:109) 2017-03-31
256415 cnd Remote V alexvsimon VERI FIXE Can not unignore an ignored file under Remote Git 2016-03-16
256421 cnd Project alexvsimon VERI FIXE java.util.ConcurrentModificationException at java.util.ArrayList$Itr.checkForComodification 2016-03-16
256458 cnd Remote V alexvsimon VERI FIXE org.netbeans.modules.deadlock.detector.Detector$DeadlockDetectedException: AWT-EventQueue-0 2016-06-14
256492 cnd -- Other alexvsimon VERI FIXE NPE at MakefileParser.parse(MakefileParser.java:110) 2016-03-16
256643 cnd Remote V alexvsimon VERI FIXE NullPointerException at org.netbeans.modules.git.remote.ui.history.SearchExecutor.appendResults 2015-12-23
256743 cnd Project alexvsimon VERI FIXE modifying launcher file isn't tracked by project 2015-12-22
256748 cnd Code Mod alexvsimon VERI FIXE inaccuracy tests: OSS IDE and Vlc 2015-12-22
256772 cnd Project alexvsimon VERI FIXE Could not verify quality of smart build analyzer. 2015-12-22
256789 cnd Project alexvsimon VERI FIXE "Limited code assistance (no associated project)" for a file from Project view 2015-12-22
256893 cnd Remote alexvsimon VERI FIXE Remote file chooser: if user presses "Up", current directory update should be interruped 2015-12-22
256904 cnd Editor alexvsimon VERI FIXE Misspelled words in comments not identified unless page scrolled a little 2015-12-21
257003 cnd Project alexvsimon VERI FIXE Error message "X is not a folder" should be "folder X doesn't exist" in project discovery dialog 2015-12-22
257114 cnd Debugger alexvsimon VERI FIXE disassmbly window does not show tabs correctly 2016-02-01
257119 cnd Remote V alexvsimon VERI FIXE Each push to the same branch requires confirmation of a new branch creation 2016-02-02
257158 cnd Navigati alexvsimon VERI FIXE goto method definition does not work when declared not in the same file as class 2016-02-04
257199 cnd Navigati alexvsimon VERI FIXE IllegalArgumentException: bad position: -1 2016-01-29
257213 cnd Remote V alexvsimon VERI FIXE Remote Git does not show Incoming Changes 2016-02-02
257256 cnd Code Mod alexvsimon VERI FIXE Fix High Priority FindBugs error: Type SA_FIELD_DOUBLE_ASSIGNMENT 2016-01-29
257288 cnd Project alexvsimon VERI FIXE NullPointerException at org.netbeans.modules.cnd.makeproject.configurations.ui.TableEditorPanel$MyTableModel.isCellEditable 2016-01-29
257294 cnd Editor alexvsimon VERI FIXE Some of CMake keywords are not highlighted. 2016-02-01
257358 cnd Toolchai alexvsimon VERI FIXE "Fix Code Assistance" not working 2016-02-03
257447 cnd Editor alexvsimon VERI FIXE using type declaration end usage not colored like typedef 2016-02-01
257448 cnd Code Mod alexvsimon VERI FIXE c++11 attributes not recognized in header file 2016-02-01
257582 cnd Project alexvsimon VERI FIXE Project discovery module does have API for discovery constants. 2016-01-29
257625 cnd Toolchai alexvsimon VERI FIXE Support new flags of latest GNU and SUN compilers 2016-02-02
257631 cnd Remote V alexvsimon VERI FIXE Annoying Git Command Failed window 2016-02-02
257643 cnd Remote alexvsimon VERI FIXE Connect hangs because IDE does not specify list of SSH authorisation methods 2016-02-02
257662 cnd Editor alexvsimon VERI FIXE Reformat does not work sometimes 2016-02-08
257710 cnd Remote V alexvsimon VERI FIXE Deadlock in remote VCS [originally had bug ID #257701] 2016-02-08
254464 groovy Grails bruno.flavio VERI FIXE Grails 3 Project structure. 2016-02-11
255967 groovy Grails bruno.flavio VERI FIXE Grails project debug is not working 2016-02-11
256159 groovy Grails bruno.flavio VERI FIXE Grails Platform version detection not working for Grails 3. 2016-02-14
255484 cnd Code Mod danilasergeyev VERI FIXE IDE ignores inherited constructor (C++11) 2016-03-16
255657 cnd -- Other danilasergeyev VERI FIXE Inspection doesn't show printf warnings during the first run 2016-03-16
255693 cnd -- Other danilasergeyev VERI FIXE printf audit doesn't recognize format string passed as variable 2016-03-16
256014 cnd Project danilasergeyev VERI FIXE AssertionError: Should be called in EDT only! 2016-03-16
256254 cnd -- Other danilasergeyev VERI FIXE printf() and uintmax_t 2016-03-16
256321 cnd -- Other danilasergeyev VERI FIXE printf() and (long)1 2015-12-10
256574 cnd Editor danilasergeyev VERI FIXE Wrong format string notification 2015-12-21
256619 cnd -- Other danilasergeyev VERI FIXE Inspect ignores checks of insecure C lib functions on the first run 2015-12-22
256578 serverpl WildFly ehsavoie VERI FIXE Wildfly starts well but its deployments aren't shown. 2016-02-03
255779 cnd Debugger henk89 VERI FIXE NullPointerException at org.netbeans.modules.cnd.debugger.gdb2.GdbDebuggerImpl.makeThreadCurrent 2015-12-23
255990 cnd Debugger henk89 VERI FIXE [mixeddev] stepping from Java into native does not work if Debugging view is open 2016-02-02
255994 cnd Debugger henk89 VERI FIXE [mixeddev] when stepping from Java JNIEnv* does not expand sometimes 2016-03-16
255995 cnd Debugger henk89 VERI FIXE [mixeddev] stepping from Java into native does not work if default host is remote 2016-03-16
255997 cnd Debugger henk89 VERI FIXE [mixeddev] ConcurrentModificationException in NativeDebuggerManager.notifyAttached 2016-03-16
256201 cnd Debugger henk89 VERI FIXE Debugger ignores symbol file from a project while attaching with a project specified 2016-03-16
257173 cnd Mixed De henk89 VERI FIXE NullPointerException at org.netbeans.modules.cnd.mixeddev.debugger.CndSessionChanger.changeSuggested 2016-01-29
251309 cnd executio ilia VERI FIXE Please enable diffie-hellman-group-exchange-sha256 algorithm for JSch connections 2016-02-03
256108 cnd executio ilia VERI FIXE Can not build Studio with Java 8 2015-12-23
256898 cnd executio ilia VERI FIXE dlight.nativeexecution Makefile support for different compilers/flags 2015-12-23
257170 cnd Project ilia VERI FIXE Warning in Freeway sample project 2016-02-01
253732 projects Generic jhavlin VERI FIXE Deadlock after IDE startup 2016-02-04
255879 db Show Dat matthias42 VERI FIXE Querying blob columns results in excessive CPU usage 2016-02-02
255974 debugger Java mentlicher VERI FIXE Do not step into boxing/unboxing methods when called from skipped code 2016-02-04
256687 debugger Java mentlicher VERI FIXE Hex byte 0x89 = octal 0111 2016-02-01
257156 debugger Code mentlicher VERI FIXE NullPointerException at org.netbeans.modules.viewmodel.TreeModelRoot$ModelChangeListener$1.run 2016-02-08
257443 javascri Debugger mentlicher VERI FIXE NullPointerException at org.netbeans.modules.web.webkit.debugging.api.css.CSS.getMatchedStyles 2016-02-04
253681 platform Text mmetelka VERI FIXE After restart IDE doesn't highlight C++11 keywords in opened files 2016-02-04
256099 cnd executio mromashova VERI FIXE unbuffer library is not supported for sparc-Linux 2016-03-16
255951 versionc Mercuria ovrabec VERI FIXE NullPointerException at org.netbeans.modules.mercurial.ui.annotate.AnnotationBar.run 2016-02-04
216095 cnd Code Mod petrk VERI FIXE Not able to resolve some identifiers from heavily templated C++ libraries 2016-02-02
246680 cnd Code Mod petrk VERI FIXE C99: nested c99 initializer (2) 2016-03-16
246684 cnd Code Mod petrk VERI FIXE C++: global variable in initialization list 2016-03-16
246693 cnd Code Mod petrk VERI FIXE c99 initializer, unexpected token: == 2016-03-16
248661 cnd Code Mod petrk VERI FIXE Variable with initializer is parsed as function 2015-12-23
253625 cnd Code Mod petrk VERI FIXE [newcodemodel] OutOfMemoryError when preprocessing delay.c 2016-01-29
253756 cnd Mixed De petrk VERI FIXE org.netbeans.modules.parsing.impl.RunWhenScanFinishedSupport.runWhenScanFinished: LowPerformance took 28909 ms. 2016-03-16
255898 cnd Code Mod petrk VERI FIXE unresolved enumerator from unnamed enum. 2016-03-16
255900 cnd Code Mod petrk VERI FIXE Unresolved static function in generated header file 2016-03-16
255903 cnd Code Mod petrk VERI FIXE unresolved enumerators in struct initializer 2016-03-16
256058 cnd Editor petrk VERI FIXE Unresolved items in editor of C++ Project With Existing Sources 2015-12-22
256068 cnd Code Mod petrk VERI FIXE inaccuracy tests: use boost 1.59.0 in order check IDE parser 2016-03-16
256281 cnd Code Mod petrk VERI FIXE parser error in builtins.h 2016-03-16
256296 cnd Code Mod petrk VERI FIXE Additional parens in expression break parser 2016-03-16
256499 cnd Mixed De petrk VERI FIXE Mixed debugging does not work 2016-03-16
256549 cnd Code Mod petrk VERI FIXE java.io.UTFDataFormatException: encoded string too long: 400008 bytes 2015-12-23
256679 cnd Mixed De petrk VERI FIXE org.netbeans.modules.parsing.impl.RunWhenScanFinishedSupport.runWhenScanFinished: LowPerformance took 29238 ms. 2016-07-13
256700 cnd Code Mod petrk VERI FIXE errors in stlport 2015-12-22
256738 cnd Code Mod petrk VERI FIXE NullPointerException at org.netbeans.modules.cnd.modelimpl.csm.deep.LazyStatementImpl.getStatementTokenStream 2015-12-23
256739 cnd Code Mod petrk VERI FIXE IDE cannot find type of (*this) in initializer 2015-12-21
257022 cnd Code Com petrk VERI FIXE NullPointerException at org.netbeans.modules.cnd.completion.cplusplus.ext.CompletionSupport.isUserConvertible 2015-12-23
257028 cnd Code Mod petrk VERI FIXE std::locale and unresolved identifier 2016-02-01
257031 cnd Code Mod petrk VERI FIXE Unresolved identifiers in ternary operator 2015-12-21
257032 cnd Code Mod petrk VERI FIXE std::tm and unresolved identifiers 2015-12-21
257038 cnd Code Mod petrk VERI FIXE C++14: make_unique and unresolved identifier 2015-12-21
257616 cnd Code Mod petrk VERI FIXE Lambdas inside if and while statements are not recognized 2016-02-01
257626 cnd Code Mod petrk VERI FIXE AssertionError: File (PARSED FileImpl @-22115423:1126733292 /export1/home/alsimon/LLVM-TRUNK/build/tools/clang/include/clang/AST/StmtNodes.inc prj:1092337503KeyBasedUID on ProjectKey /export1/home/als 2016-02-04
257647 cnd Code Mod petrk VERI FIXE C pointer arithmetic and invalid hints in fprintf() 2016-02-02
256817 projects Maven pgebauer VERI FIXE org-eclipse-jgit-RELEASE81.jar due to invalid entry size (expected 1159200768 but got 133988 bytes) 2016-02-04
256664 javascri RequireJ ppisl VERI FIXE NullPointerException at org.netbeans.modules.javascript2.requirejs.editor.RequireJSCodeCompletion.complete 2016-02-03
256729 javascri RequireJ ppisl VERI FIXE IllegalArgumentException: URI has a query component 2016-02-03
255878 javascri Node.js tmysik VERI FIXE Show proper node.js version in IDE Options 2016-02-08
255912 web HTML Pro tmysik VERI FIXE NullPointerException at org.netbeans.modules.web.clientproject.ClientSideProjectConvertor$ConvertorClassPathProvider.findClassPath 2016-05-10
256453 php Project tmysik VERI FIXE IndexOutOfBoundsException: Index: 29, Size: 28 2016-02-03
256552 php Phing tmysik VERI FIXE Phing targets not available on build.xml not directly in project directory 2016-02-03
256584 javascri Tools tmysik VERI FIXE No output when external cmd fails 2016-02-03
257391 php FTP Supp tmysik VERI FIXE Annoying Remember Remote Synchronization dialog 2018-01-18
255699 projects Maven tstupka VERI FIXE Unable to build deployments artifact with RELEASE81-BETA 2016-02-03
256175 projects Maven tstupka VERI FIXE 138310 happening continuously in NB 8.1 RC2 2016-02-15
256199 connecte Bugzilla tstupka VERI FIXE Attach IDE snapshot to bug doesn't work 2016-02-02
251101 cnd Remote vkvashin VERI FIXE unresolved identifiers in Full Remote project if build system generates code 2016-02-03
255926 cnd Remote vkvashin VERI FIXE java.io.FileNotFoundException: .rfs_attr (Access is denied) 2015-12-23
256125 cnd Code Mod vkvashin VERI FIXE [newcodemodel] Exception: Can not resolve file by path in macro directive: [[230-269] annotation=null/home/alsimon/NetBeansProjects/clucene-core-0.9.21b/src/CLucene/config/gunichartables.h #define G_UNICODE_MAX_TABL 2016-01-29
256279 cnd Code Mod vkvashin VERI FIXE [newcodemodel] unresolved #include "/abs/path" in full remote project 2015-12-22
256625 cnd Code Mod vkvashin VERI FIXE [newcodemodel] AssertionError: getIdentifierInfo() on a tok::raw_identifier token! kind:raw_identifier 2016-01-29
256627 cnd Remote vkvashin VERI FIXE java.io.IOException: Error creating directory C:\Users\svass\AppData\Local\NetBeans\Cache\8.1\remote-files\[10.39.33.233:22C]_22_root 2016-01-29
256628 cnd Code Mod vkvashin VERI FIXE [newcodemodel] AssertionError: Invalid token lexed 2016-01-29
256629 cnd Code Mod vkvashin VERI FIXE [newcodemodel] StringIndexOutOfBoundsException: String index out of range: -8 2016-01-29
256630 cnd Code Mod vkvashin VERI FIXE [newcodemodel] AssertionError: must be non negative -2 2015-12-21
256803 cnd Remote vkvashin VERI FIXE Can not verify fs_server quality with Studio analysis tools 2015-12-23
256855 cnd Remote vkvashin VERI FIXE Fix security issues in fs_server that were discovered by dynamic and static tests 2015-12-23
256914 cnd Remote vkvashin VERI FIXE Can not verify auto-copy binaries with Studio analysis tools ( 2015-12-23
256919 cnd Remote vkvashin VERI FIXE fix issues discovered in rfs_controller and rfs_preload 2016-01-29
256933 cnd Code Mod vkvashin VERI FIXE [newcodemodel] IDE cannot resolve include paths with non ASCII chars 2016-02-01
256947 cnd Remote vkvashin VERI FIXE Annoying exceptions in console: Error Downloading /etc/auto.master 2015-12-22
256951 cnd Remote vkvashin VERI FIXE Remove full file path (including user name) from fs_server binaries 2016-01-29
257133 cnd Code Mod vkvashin VERI FIXE [newcodemodel] AssertionError: Cannot modify const object! 2016-02-01
257165 cnd Remote vkvashin VERI FIXE org.netbeans.modules.deadlock.detector.Detector$DeadlockDetectedException: Remote File System RefreshManager tatianama@ip-10-201-1-40.ec2.tbricks.com 2016-01-29
257210 cnd Remote vkvashin VERI FIXE Stable exception in remote test logs 2016-01-29
257274 cnd Remote vkvashin VERI FIXE There still are security issues in fs_server (discovered by dynamic and static tests) 2016-01-29
257286 cnd Project vkvashin VERI FIXE Discovery by exec log spoils project configuration in the case of simple (SFTP) remote 2016-01-29
257293 cnd Remote vkvashin VERI FIXE "Compile File" works wrongly in "Automating Copying" mode 2016-02-01
257565 cnd Remote vkvashin VERI FIXE FileAlreadyLockedException: /home/vk/.../fs_server/nbproject/private/timestamps-svarog-vkvashin-22 2016-02-03
257591 cnd Remote vkvashin VERI FIXE java.util.concurrent.ExecutionException: fs_server [3770 140022993700672]: error locking lock file /var/tmp/dlight_c4dev/87210c76/fs_server_cache/lock: Resource temporarily unavailable 2016-01-29
257593 cnd Remote vkvashin VERI FIXE Allow using remote terminal on arm if the appropriate binary exists 2016-02-04
257604 cnd Remote vkvashin VERI FIXE IllegalArgumentException: Error processing response Package[FS_RSP_ENTRY e 96 5 IMAGE d 4096 -1161096504000 rwx 2049 39674529 0 ] 2016-01-29
256093 cnd Navigati vv159170 VERI FIXE INFO [dlight.libs.common.logger]: no any active cache transaction:class org.netbeans.modules.cnd.api.model.services.CsmSelect$ClassMembersKey 2016-03-16
256114 cnd Code Mod vv159170 VERI FIXE AssertionError: why hasn't stopped after interested file? restore <pthread.h> [131:4/3862-131:24/3882] #0 from line 131 in file PARSED FileImpl @1752398907:2041929660 /home/sova/clucene-core-0.9.11/sr 2016-03-16
256148 cnd Code Mod vv159170 VERI FIXE AssertionError at org.netbeans.modules.cnd.modelimpl.parser.clank.ClankTokenStreamProducer$FileImplPreprocessorCallback.getCurFile 2016-03-16
256186 cnd Navigati vv159170 VERI FIXE during refactoring a lot of editStart/editEnd events cause unnecessary reparsing activity 2016-03-16
256278 cnd Code Mod vv159170 VERI FIXE Exception: Path should not start with protocol 2016-03-16
256285 cnd Code Mod vv159170 VERI FIXE Project with existing code lost C++11 flag after opening 2016-02-03
256315 cnd Code Mod vv159170 VERI FIXE Unresolved type at offset 0 2016-03-16
256326 cnd Code Mod vv159170 VERI FIXE [newcodemodel] regression in vlc 2016-03-16
256434 cnd Code Mod vv159170 VERI FIXE [newcodemodel]AssertionError: no OpCapable for LESS/GREATER for DiagStatePoint{ Loc=[string size=64+'0'] C:\Developer\lib\c++\PPP2_Support_Code\std_lib_facilities.h:24:2 State=null } vs. DiagStatePoint{ Loc=[string 2016-03-16
256457 cnd Code Mod vv159170 VERI FIXE [newcodemodel] NullPointerException at org.netbeans.modules.cnd.spi.utils.CndFileSystemProvider$DefaultProvider.urlToFileSystemImpl 2016-03-16
257007 platform Text vv159170 VERI FIXE NullPointerException at org.openide.text.LineVector.getLinesInRange 2016-01-27
257328 cnd Code Mod vv159170 VERI FIXE SEVERE [org.openide.util.RequestProcessor]: Error in RequestProcessor org.netbeans.modules.cnd.highlight.semantic.SemanticHighlighter$TaskContext java.lang.NullPointerException 2016-02-03
257452 cnd Code Mod vv159170 VERI FIXE AssertionError: why hasn't stopped after interested file? restore <boost/type_traits/is_pod.hpp> [38:1/1179-38:40/1218] #2 from line 38 in file PARSED FileImpl @-545138773:1600398274 /usr/include/boos 2016-02-03
257559 cnd Code Mod vv159170 VERI FIXE Assertion when namespace definition is removed 2016-02-04
257576 cnd Project vv159170 VERI FIXE Externally modified project metadata breaks IDE behavior in several ways. 2016-02-03
226012 cnd Code Mod vv159170 CLOS FIXE [74cat] AssertionError: no object for UID KeyBasedUID on FileKey (D:/PROJECTS/Identification/Application/N/, D:\PROJECTS\Identification\Application\IdEmulation\src\ExpressionParser.cpp) in object class org.ne 2017-05-17
218 bugs found.

as