Issue 117726 - cairo fails to build, lacks dependency on libpng
Summary: cairo fails to build, lacks dependency on libpng
Status: CONFIRMED
Alias: None
Product: Build Tools
Classification: Code
Component: external prerequisites (show other issues)
Version: 4.0.0-dev
Hardware: All All
: P1 (highest) Normal (vote)
Target Milestone: ---
Assignee: AOO issues mailing list
QA Contact:
URL:
Keywords:
Depends on:
Blocks:
 
Reported: 2011-04-06 08:28 UTC by Stephan Bergmann
Modified: 2017-05-20 11:29 UTC (History)
1 user (show)

See Also:
Issue Type: DEFECT
Latest Confirmation in: ---
Developer Difficulty: ---


Attachments

Note You need to log in before you can comment on or make changes to this issue.
Description Stephan Bergmann 2011-04-06 08:28:49 UTC
At least parallelizing wntmsci12 pro/non-pro setsolar builds of DEV300_m106 based CWS sb140 failed with

> cairo-png.c
> cairo-png.c(42) : fatal error C1083: Cannot open include file: 'png.h': No such file or directory
> make[1]: *** [release/cairo-png.obj] Error 2
> make[1]: Leaving directory `/cygdrive/c/shared/solar/o_sb140/DEV300/ooo/cairo/wntmsci12/misc/build/cairo-1.8.0/src'
> make: *** [cairo] Error 1
> dmake:  Error code 2, while making '../wntmsci12/misc/build/so_built_so_cairo'
>
> 1 module(s): 
> 	cairo
> need(s) to be rebuilt
>
> Reason(s):
>
> ERROR: error 65280 occurred while making /cygdrive/c/shared/solar/o_sb140/DEV300/ooo/cairo/cairo
Comment 1 Oliver-Rainer Wittmann 2012-06-13 12:24:34 UTC
getting rid of value "enhancement" for field "severity".
For enhancement the field "issue type" shall be used.
Comment 2 Marcus 2017-05-20 11:29:18 UTC
Reset assigne to the default "issues@openoffice.apache.org".